ID,gewicht,s_dat,Start,DURA,FEDSTATE,FED_Strict,FED_Cases,POP,POP_cat,GENDER,AGE,AGE_group,EDU,MARITAL,LIVALONE,PART,RELA,OTH,LIVSIT3,LIVSIT2,ASSLIV,INST,NoHH,WORRY,THREAT,AGETHREAT,PRECOND,SUPMEAS,SUPMEAS_dich,RESTR,CoVInf_Self,CoVInf_HHFam,CoVInf_FRNB,CoVInf_OTH,CoVInf_No,QUA_Self,QUA_HHFam,QUA_FRNB,QUA_OTH,QUA_No,CONTHH,CONTOHH,SUPADL,SI,MEDI,ESSI,ESSI_cat,PTSS,PTSS_cat,SOMA1,DEP1,ANX1,GSI1,SOMA,DEP,ANX,GSI,UCLA,UCLA_cat,BRS,BRS_M,BRS_cat,PSS,IIIIIIIIIIIIIIIIIIIIIIIIIIIIIIIIIIIIIIIIIII,c2_06,c2,c2_00,c2_01,c2_99,c3,c4,q21,q21_00,q21_99,q22,q22_00,q22_99,q61,q62,q63,q64,q65,q71,q72,q73,q74,q75,q76,q77,q78,q79,q710,q81,q82,q83,q84,q85,q86,q87,q88,q89,q810,q811,q812,q813,q814,q815,q816,q817,q818,q91,q91r,q92,q92r,q93,q93r,q1001,q1002,q1002r,q1003,q1004,q1004r,q1005,q1006,q1006r,q111,q111r,q112,q112r,q113,q113r,q114,q114r,q100,q101,q11,q12,q13,q14,q15,q16,q21_01,q21_02,q21_03,q21_04,q21_05,q22_01,q22_02,q22_03,q22_04,q22_05,q31,q32,q4,q5,c1,c2_02,c2_03,c2_04,c2_05,c2_07,q104,land,gkpol
1.0,0.5984573632537125,2020-04-06,2020-03-22,15.0,5.0,0.0,,7.0,,2.0,78.0,3.0,2.0,3.0,1.0,0.0,0.0,0.0,1.0,1.0,0.0,0.0,-2.0,5.0,2.0,3.0,3.0,5.0,1.0,3.0,0.0,0.0,0.0,0.0,1.0,0.0,0.0,0.0,0.0,1.0,3.0,4.0,2.0,0.0,1.0,23.0,1.0,24.0,1.0,3.0,3.0,4.0,10.0,9.0,9.0,10.0,28.0,5.0,0.0,18.0,3.0,1.0,7.0,,0.0,"01,",0.0,1.0,0.0,3.0,2.0,"05,",0.0,0.0,"05,",0.0,0.0,5.0,4.0,5.0,5.0,4.0,2.0,0.0,0.0,3.0,3.0,5.0,2.0,0.0,3.0,6.0,1.0,0.0,1.0,0.0,1.0,0.0,1.0,0.0,0.0,1.0,1.0,0.0,1.0,1.0,1.0,0.0,0.0,1.0,2.0,2.0,2.0,2.0,4.0,1.0,3.0,3.0,3.0,3.0,3.0,3.0,3.0,3.0,3.0,3.0,2.0,3.0,2.0,3.0,2.0,2.0,1.0,2.0,78.0,5.0,2.0,3.0,3.0,5.0,3.0,0.0,0.0,0.0,0.0,1.0,0.0,0.0,0.0,0.0,1.0,3.0,4.0,2.0,1.0,3.0,0.0,0.0,0.0,0.0,0.0,-2.0,5.0,7.0
2.0,0.5390922080281528,2020-04-07,2020-03-22,16.0,6.0,0.0,,3.0,,1.0,70.0,2.0,1.0,4.0,1.0,0.0,0.0,0.0,1.0,1.0,0.0,0.0,-2.0,5.0,5.0,5.0,5.0,5.0,1.0,3.0,0.0,0.0,0.0,0.0,1.0,0.0,0.0,0.0,0.0,1.0,1.0,3.0,1.0,1.0,3.0,14.0,0.0,9.0,0.0,4.0,2.0,3.0,9.0,10.0,8.0,9.0,27.0,5.0,0.0,30.0,5.0,2.0,5.0,,0.0,"01,",0.0,1.0,0.0,2.0,4.0,"05,",0.0,0.0,"05,",0.0,0.0,4.0,2.0,3.0,4.0,1.0,3.0,0.0,0.0,2.0,0.0,0.0,1.0,0.0,0.0,3.0,0.0,0.0,0.0,0.0,2.0,2.0,0.0,2.0,0.0,0.0,0.0,0.0,3.0,0.0,0.0,0.0,0.0,0.0,1.0,3.0,4.0,1.0,4.0,1.0,5.0,1.0,5.0,5.0,1.0,5.0,5.0,1.0,5.0,4.0,3.0,5.0,0.0,3.0,2.0,1.0,0.0,1.0,70.0,5.0,5.0,5.0,5.0,5.0,3.0,0.0,0.0,0.0,0.0,1.0,0.0,0.0,0.0,0.0,1.0,1.0,3.0,1.0,3.0,4.0,0.0,0.0,0.0,0.0,0.0,-2.0,6.0,3.0
3.0,1.0155094665076425,2020-04-06,2020-03-22,15.0,5.0,0.0,,4.0,,2.0,86.0,5.0,1.0,4.0,1.0,0.0,0.0,0.0,1.0,1.0,0.0,0.0,-2.0,2.0,2.0,4.0,2.0,5.0,1.0,2.0,0.0,0.0,0.0,0.0,1.0,0.0,0.0,0.0,0.0,1.0,1.0,2.0,1.0,1.0,2.0,23.0,1.0,6.0,0.0,6.0,0.0,2.0,8.0,12.0,6.0,8.0,26.0,4.0,0.0,18.0,3.0,1.0,8.0,,0.0,"01,",0.0,1.0,0.0,2.0,2.0,"05,",0.0,0.0,"05,",0.0,0.0,4.0,5.0,4.0,5.0,5.0,3.0,0.0,0.0,3.0,0.0,0.0,0.0,0.0,0.0,0.0,0.0,0.0,1.0,0.0,2.0,3.0,0.0,0.0,0.0,0.0,0.0,0.0,1.0,0.0,0.0,0.0,1.0,0.0,2.0,2.0,3.0,1.0,3.0,1.0,2.0,2.0,4.0,3.0,2.0,4.0,2.0,3.0,3.0,1.0,0.0,2.0,3.0,1.0,4.0,2.0,1.0,2.0,86.0,2.0,2.0,4.0,2.0,5.0,2.0,0.0,0.0,0.0,0.0,1.0,0.0,0.0,0.0,0.0,1.0,1.0,2.0,1.0,2.0,4.0,0.0,0.0,0.0,0.0,0.0,-2.0,5.0,4.0
4.0,0.4335298389153332,2020-04-06,2020-03-22,15.0,16.0,0.0,,3.0,,2.0,65.0,1.0,2.0,1.0,0.0,1.0,0.0,0.0,2.0,2.0,0.0,0.0,-2.0,5.0,3.0,3.0,1.0,5.0,1.0,3.0,0.0,0.0,0.0,0.0,1.0,0.0,0.0,0.0,0.0,1.0,1.0,2.0,2.0,0.0,1.0,25.0,1.0,2.0,0.0,0.0,0.0,0.0,0.0,6.0,6.0,6.0,18.0,4.0,0.0,18.0,3.0,1.0,2.0,,0.0,"02,",0.0,0.0,0.0,3.0,2.0,"05,",0.0,0.0,"05,",0.0,0.0,5.0,5.0,5.0,5.0,5.0,0.0,0.0,0.0,0.0,0.0,0.0,0.0,0.0,0.0,2.0,0.0,0.0,0.0,0.0,0.0,0.0,0.0,0.0,0.0,0.0,0.0,0.0,0.0,0.0,0.0,0.0,0.0,0.0,2.0,2.0,4.0,1.0,4.0,1.0,2.0,3.0,3.0,3.0,3.0,3.0,4.0,3.0,3.0,2.0,1.0,5.0,0.0,4.0,1.0,1.0,0.0,2.0,65.0,5.0,3.0,3.0,1.0,5.0,3.0,0.0,0.0,0.0,0.0,1.0,0.0,0.0,0.0,0.0,1.0,1.0,2.0,2.0,1.0,1.0,1.0,0.0,0.0,0.0,0.0,-2.0,16.0,3.0
5.0,0.8601923875040632,2020-04-06,2020-03-22,15.0,8.0,0.0,,3.0,,1.0,83.0,4.0,3.0,1.0,0.0,1.0,0.0,0.0,2.0,2.0,0.0,0.0,-2.0,5.0,2.0,5.0,5.0,5.0,1.0,1.0,0.0,0.0,0.0,0.0,1.0,0.0,0.0,0.0,0.0,1.0,1.0,3.0,3.0,0.0,2.0,21.0,1.0,9.0,0.0,6.0,0.0,0.0,6.0,12.0,6.0,6.0,24.0,4.0,0.0,20.0,3.3333333333333335,1.0,6.0,,0.0,"02,",0.0,0.0,0.0,5.0,5.0,"05,",0.0,0.0,"05,",0.0,0.0,5.0,2.0,4.0,5.0,5.0,3.0,0.0,0.0,0.0,6.0,0.0,0.0,0.0,0.0,0.0,0.0,0.0,0.0,0.0,3.0,3.0,0.0,0.0,0.0,0.0,0.0,0.0,0.0,0.0,0.0,0.0,0.0,0.0,2.0,2.0,4.0,1.0,4.0,1.0,5.0,1.0,5.0,1.0,1.0,5.0,1.0,3.0,3.0,3.0,2.0,1.0,4.0,5.0,0.0,1.0,0.0,1.0,83.0,5.0,2.0,5.0,5.0,5.0,1.0,0.0,0.0,0.0,0.0,1.0,0.0,0.0,0.0,0.0,1.0,1.0,3.0,3.0,2.0,1.0,1.0,0.0,0.0,0.0,0.0,-2.0,8.0,3.0
6.0,1.096679257606252,2020-04-06,2020-03-22,15.0,8.0,0.0,,3.0,,2.0,68.0,1.0,2.0,1.0,0.0,1.0,0.0,0.0,2.0,2.0,0.0,0.0,-2.0,4.0,3.0,2.0,2.0,5.0,1.0,3.0,0.0,0.0,0.0,1.0,0.0,0.0,0.0,0.0,0.0,1.0,3.0,6.0,2.0,0.0,99.0,,,6.0,0.0,0.0,1.0,1.0,2.0,6.0,7.0,7.0,20.0,5.0,0.0,22.0,3.6666666666666665,1.0,7.0,,0.0,"02,",0.0,0.0,0.0,3.0,2.0,"04,",0.0,0.0,"05,",0.0,0.0,2.0,3.0,4.0,,1.0,1.0,0.0,0.0,1.0,1.0,1.0,0.0,0.0,1.0,1.0,0.0,0.0,0.0,0.0,0.0,0.0,0.0,0.0,0.0,0.0,1.0,0.0,0.0,0.0,0.0,0.0,0.0,1.0,2.0,2.0,3.0,1.0,2.0,2.0,5.0,1.0,5.0,2.0,3.0,3.0,4.0,3.0,3.0,4.0,3.0,4.0,1.0,2.0,3.0,1.0,0.0,2.0,68.0,4.0,3.0,2.0,2.0,5.0,3.0,0.0,0.0,0.0,1.0,0.0,0.0,0.0,0.0,0.0,1.0,3.0,6.0,2.0,99.0,1.0,1.0,0.0,0.0,0.0,0.0,-2.0,8.0,3.0
7.0,0.7229964081268537,2020-04-06,2020-03-22,15.0,3.0,0.0,,4.0,,2.0,71.0,2.0,1.0,3.0,1.0,0.0,0.0,0.0,1.0,1.0,0.0,0.0,-2.0,5.0,2.0,2.0,5.0,4.0,1.0,2.0,0.0,0.0,0.0,0.0,1.0,0.0,0.0,0.0,0.0,1.0,2.0,2.0,1.0,0.0,3.0,23.0,1.0,13.0,0.0,0.0,2.0,0.0,2.0,6.0,8.0,6.0,20.0,3.0,0.0,23.0,3.8333333333333335,1.0,,,0.0,"01,",0.0,1.0,0.0,2.0,2.0,"05,",0.0,0.0,"05,",0.0,0.0,5.0,4.0,4.0,5.0,5.0,0.0,0.0,5.0,0.0,4.0,0.0,0.0,0.0,0.0,4.0,0.0,0.0,0.0,0.0,0.0,0.0,1.0,0.0,1.0,0.0,0.0,0.0,0.0,0.0,0.0,0.0,0.0,0.0,4.0,1.0,4.0,1.0,4.0,1.0,4.0,3.0,3.0,4.0,3.0,3.0,4.0,1.0,5.0,2.0,1.0,5.0,0.0,,,1.0,0.0,2.0,71.0,5.0,2.0,2.0,5.0,4.0,2.0,0.0,0.0,0.0,0.0,1.0,0.0,0.0,0.0,0.0,1.0,2.0,2.0,1.0,3.0,3.0,0.0,0.0,0.0,0.0,0.0,-2.0,3.0,4.0
8.0,1.1567029184975075,2020-04-06,2020-03-22,15.0,5.0,0.0,,3.0,,2.0,65.0,1.0,1.0,1.0,0.0,1.0,0.0,0.0,2.0,2.0,0.0,0.0,-2.0,3.0,3.0,3.0,4.0,5.0,1.0,3.0,0.0,0.0,0.0,0.0,1.0,0.0,0.0,0.0,0.0,1.0,2.0,5.0,2.0,0.0,1.0,22.0,1.0,1.0,0.0,0.0,0.0,0.0,0.0,6.0,6.0,6.0,18.0,3.0,0.0,18.0,3.0,1.0,6.0,,0.0,"02,",0.0,0.0,0.0,2.0,2.0,"05,",0.0,0.0,"05,",0.0,0.0,5.0,2.0,5.0,5.0,5.0,0.0,0.0,0.0,0.0,0.0,1.0,0.0,0.0,0.0,0.0,0.0,0.0,0.0,0.0,0.0,0.0,0.0,0.0,0.0,0.0,0.0,0.0,0.0,0.0,0.0,0.0,0.0,0.0,4.0,1.0,4.0,1.0,4.0,1.0,3.0,1.0,5.0,3.0,4.0,2.0,3.0,4.0,2.0,4.0,3.0,4.0,1.0,3.0,2.0,1.0,0.0,2.0,65.0,3.0,3.0,3.0,4.0,5.0,3.0,0.0,0.0,0.0,0.0,1.0,0.0,0.0,0.0,0.0,1.0,2.0,5.0,2.0,1.0,1.0,1.0,0.0,0.0,0.0,0.0,-2.0,5.0,3.0
9.0,0.9309345513109492,2020-04-07,2020-03-22,16.0,9.0,1.0,,3.0,,1.0,81.0,4.0,3.0,1.0,0.0,1.0,0.0,0.0,2.0,2.0,0.0,0.0,-2.0,5.0,3.0,5.0,2.0,5.0,1.0,2.0,0.0,0.0,0.0,0.0,1.0,0.0,0.0,0.0,0.0,1.0,3.0,6.0,2.0,0.0,1.0,25.0,1.0,5.0,0.0,3.0,0.0,0.0,3.0,9.0,6.0,6.0,21.0,3.0,0.0,,,,2.0,,0.0,"02,",0.0,0.0,0.0,6.0,5.0,"05,",0.0,0.0,"05,",0.0,0.0,5.0,5.0,5.0,5.0,5.0,0.0,0.0,0.0,0.0,0.0,5.0,0.0,0.0,0.0,0.0,0.0,0.0,0.0,0.0,1.0,2.0,0.0,0.0,0.0,0.0,0.0,0.0,0.0,0.0,0.0,0.0,0.0,0.0,3.0,1.0,4.0,1.0,4.0,1.0,5.0,1.0,5.0,5.0,,,5.0,,,3.0,2.0,5.0,0.0,5.0,0.0,1.0,0.0,1.0,81.0,5.0,3.0,5.0,2.0,5.0,2.0,0.0,0.0,0.0,0.0,1.0,0.0,0.0,0.0,0.0,1.0,3.0,6.0,2.0,1.0,1.0,1.0,0.0,0.0,0.0,0.0,-2.0,9.0,3.0
10.0,1.3079576937344723,2020-04-06,2020-03-22,15.0,12.0,1.0,,2.0,,2.0,70.0,2.0,2.0,1.0,0.0,1.0,0.0,0.0,2.0,2.0,0.0,0.0,-2.0,3.0,2.0,3.0,1.0,5.0,1.0,2.0,0.0,0.0,0.0,0.0,1.0,0.0,0.0,0.0,0.0,1.0,2.0,5.0,2.0,0.0,1.0,20.0,1.0,7.0,0.0,0.0,0.0,0.0,0.0,6.0,6.0,6.0,18.0,4.0,0.0,25.0,4.166666666666667,1.0,5.0,,0.0,"02,",0.0,0.0,0.0,3.0,2.0,"05,",0.0,0.0,"05,",0.0,0.0,5.0,3.0,5.0,5.0,2.0,2.0,0.0,0.0,0.0,2.0,2.0,0.0,0.0,1.0,0.0,0.0,0.0,0.0,0.0,0.0,0.0,0.0,0.0,0.0,0.0,0.0,0.0,0.0,0.0,0.0,0.0,0.0,0.0,2.0,2.0,4.0,1.0,4.0,1.0,4.0,2.0,4.0,5.0,2.0,4.0,5.0,3.0,3.0,2.0,1.0,4.0,1.0,3.0,2.0,2.0,1.0,2.0,70.0,3.0,2.0,3.0,1.0,5.0,2.0,0.0,0.0,0.0,0.0,1.0,0.0,0.0,0.0,0.0,1.0,2.0,5.0,2.0,1.0,1.0,1.0,0.0,0.0,0.0,0.0,-2.0,12.0,2.0
11.0,1.228130629930487,2020-04-07,2020-03-22,16.0,9.0,1.0,,4.0,,2.0,77.0,3.0,2.0,1.0,0.0,1.0,0.0,0.0,2.0,2.0,0.0,0.0,-2.0,5.0,5.0,1.0,1.0,5.0,1.0,5.0,0.0,0.0,0.0,0.0,1.0,0.0,0.0,0.0,0.0,1.0,5.0,6.0,2.0,0.0,1.0,25.0,1.0,7.0,0.0,1.0,3.0,0.0,4.0,7.0,9.0,6.0,22.0,4.0,0.0,25.0,4.166666666666667,1.0,10.0,,0.0,"02,",0.0,0.0,0.0,6.0,4.0,"05,",0.0,0.0,"05,",0.0,0.0,5.0,5.0,5.0,5.0,5.0,0.0,0.0,2.0,0.0,0.0,2.0,0.0,0.0,0.0,3.0,0.0,0.0,0.0,0.0,0.0,1.0,3.0,0.0,0.0,0.0,0.0,0.0,0.0,0.0,0.0,0.0,0.0,0.0,2.0,2.0,4.0,1.0,4.0,1.0,5.0,4.0,2.0,5.0,1.0,5.0,5.0,3.0,3.0,5.0,4.0,3.0,2.0,3.0,2.0,3.0,2.0,2.0,77.0,5.0,5.0,1.0,1.0,5.0,5.0,0.0,0.0,0.0,0.0,1.0,0.0,0.0,0.0,0.0,1.0,5.0,6.0,2.0,1.0,1.0,1.0,0.0,0.0,0.0,0.0,-2.0,9.0,4.0
12.0,0.5946493620293091,2020-04-06,2020-03-22,15.0,14.0,1.0,,7.0,,2.0,65.0,1.0,3.0,3.0,1.0,0.0,0.0,0.0,1.0,1.0,0.0,0.0,-2.0,2.0,2.0,3.0,1.0,4.0,1.0,3.0,0.0,0.0,0.0,0.0,1.0,0.0,0.0,0.0,1.0,0.0,2.0,3.0,2.0,0.0,99.0,18.0,0.0,18.0,0.0,3.0,1.0,2.0,6.0,9.0,7.0,8.0,24.0,3.0,0.0,19.0,3.1666666666666665,1.0,4.0,,0.0,"01,",0.0,1.0,0.0,6.0,6.0,"05,",0.0,0.0,"04,",0.0,0.0,5.0,2.0,4.0,2.0,5.0,1.0,1.0,0.0,0.0,5.0,2.0,1.0,2.0,1.0,5.0,1.0,1.0,0.0,1.0,0.0,0.0,0.0,1.0,0.0,0.0,0.0,0.0,0.0,1.0,0.0,0.0,1.0,0.0,3.0,1.0,3.0,1.0,3.0,1.0,3.0,3.0,3.0,3.0,3.0,3.0,4.0,3.0,3.0,3.0,2.0,5.0,0.0,4.0,1.0,2.0,1.0,2.0,65.0,2.0,2.0,3.0,1.0,4.0,3.0,0.0,0.0,0.0,0.0,1.0,0.0,0.0,0.0,1.0,0.0,2.0,3.0,2.0,99.0,3.0,0.0,0.0,0.0,0.0,0.0,-2.0,14.0,7.0
13.0,0.6997164452538772,2020-04-06,2020-03-22,15.0,13.0,0.0,,5.0,,2.0,70.0,2.0,2.0,2.0,1.0,0.0,0.0,0.0,1.0,1.0,0.0,0.0,-2.0,3.0,3.0,2.0,3.0,5.0,1.0,1.0,0.0,0.0,0.0,0.0,1.0,0.0,0.0,0.0,0.0,1.0,1.0,3.0,2.0,1.0,1.0,18.0,0.0,10.0,0.0,1.0,0.0,0.0,1.0,7.0,6.0,6.0,19.0,4.0,0.0,23.0,3.8333333333333335,1.0,10.0,,0.0,"01,",0.0,1.0,0.0,6.0,3.0,"05,",0.0,0.0,"05,",0.0,0.0,5.0,3.0,3.0,3.0,4.0,3.0,0.0,2.0,0.0,2.0,0.0,3.0,0.0,0.0,0.0,0.0,1.0,0.0,0.0,0.0,0.0,0.0,0.0,0.0,0.0,0.0,0.0,0.0,0.0,0.0,0.0,0.0,0.0,4.0,1.0,2.0,2.0,3.0,1.0,4.0,1.0,5.0,3.0,3.0,3.0,5.0,3.0,3.0,4.0,3.0,3.0,2.0,2.0,3.0,3.0,2.0,2.0,70.0,3.0,3.0,2.0,3.0,5.0,1.0,0.0,0.0,0.0,0.0,1.0,0.0,0.0,0.0,0.0,1.0,1.0,3.0,2.0,1.0,2.0,0.0,0.0,0.0,0.0,0.0,-2.0,13.0,5.0
14.0,0.5334185255440398,2020-04-06,2020-03-22,15.0,1.0,0.0,,1.0,,1.0,83.0,4.0,3.0,4.0,1.0,0.0,0.0,0.0,1.0,1.0,0.0,0.0,-2.0,2.0,2.0,4.0,3.0,4.0,1.0,3.0,0.0,0.0,0.0,0.0,1.0,0.0,0.0,0.0,0.0,1.0,2.0,2.0,2.0,0.0,1.0,20.0,1.0,7.0,0.0,1.0,2.0,0.0,3.0,7.0,8.0,6.0,21.0,3.0,0.0,27.0,4.5,2.0,8.0,,0.0,"01,",0.0,1.0,0.0,3.0,5.0,"05,",0.0,0.0,"05,",0.0,0.0,4.0,5.0,3.0,5.0,3.0,0.0,0.0,3.0,0.0,0.0,0.0,4.0,0.0,0.0,0.0,0.0,0.0,0.0,0.0,0.0,1.0,0.0,1.0,1.0,0.0,0.0,0.0,0.0,0.0,0.0,0.0,0.0,0.0,3.0,1.0,4.0,1.0,4.0,1.0,5.0,1.0,5.0,2.0,1.0,5.0,5.0,1.0,5.0,2.0,1.0,1.0,4.0,2.0,3.0,1.0,0.0,1.0,83.0,2.0,2.0,4.0,3.0,4.0,3.0,0.0,0.0,0.0,0.0,1.0,0.0,0.0,0.0,0.0,1.0,2.0,2.0,2.0,1.0,4.0,0.0,0.0,0.0,0.0,0.0,-2.0,1.0,1.0
15.0,1.1567029184975075,2020-04-06,2020-03-22,15.0,5.0,0.0,,6.0,,2.0,68.0,1.0,1.0,1.0,0.0,1.0,0.0,0.0,2.0,2.0,0.0,0.0,-2.0,3.0,2.0,2.0,1.0,5.0,1.0,2.0,0.0,0.0,0.0,0.0,1.0,0.0,0.0,0.0,0.0,1.0,2.0,4.0,1.0,0.0,2.0,24.0,1.0,2.0,0.0,0.0,0.0,0.0,0.0,6.0,6.0,6.0,18.0,3.0,0.0,26.0,4.333333333333333,2.0,3.0,,0.0,"02,",0.0,0.0,0.0,2.0,2.0,"05,",0.0,0.0,"05,",0.0,0.0,4.0,5.0,5.0,5.0,5.0,0.0,0.0,0.0,0.0,0.0,2.0,0.0,0.0,0.0,0.0,0.0,0.0,0.0,0.0,0.0,0.0,0.0,0.0,0.0,0.0,0.0,0.0,0.0,0.0,0.0,0.0,0.0,0.0,3.0,1.0,3.0,1.0,4.0,1.0,5.0,3.0,3.0,5.0,3.0,3.0,5.0,1.0,5.0,2.0,1.0,4.0,1.0,4.0,1.0,1.0,0.0,2.0,68.0,3.0,2.0,2.0,1.0,5.0,2.0,0.0,0.0,0.0,0.0,1.0,0.0,0.0,0.0,0.0,1.0,2.0,4.0,1.0,2.0,1.0,1.0,0.0,0.0,0.0,0.0,-2.0,5.0,6.0
16.0,0.9309345513109492,2020-04-07,2020-03-22,16.0,9.0,1.0,,3.0,,1.0,82.0,4.0,2.0,1.0,0.0,1.0,0.0,0.0,2.0,2.0,0.0,0.0,-2.0,3.0,3.0,4.0,2.0,5.0,1.0,2.0,0.0,0.0,0.0,0.0,1.0,0.0,0.0,0.0,0.0,1.0,5.0,6.0,1.0,0.0,3.0,25.0,1.0,4.0,0.0,1.0,0.0,0.0,1.0,7.0,6.0,6.0,19.0,4.0,0.0,24.0,4.0,1.0,6.0,,0.0,"02,",0.0,0.0,0.0,6.0,2.0,"05,",0.0,0.0,"05,",0.0,0.0,5.0,5.0,5.0,5.0,5.0,2.0,0.0,0.0,0.0,0.0,2.0,0.0,0.0,0.0,0.0,0.0,0.0,0.0,0.0,1.0,0.0,0.0,0.0,0.0,0.0,0.0,0.0,0.0,0.0,0.0,0.0,0.0,0.0,3.0,1.0,4.0,1.0,2.0,2.0,4.0,2.0,4.0,4.0,2.0,4.0,4.0,2.0,4.0,3.0,2.0,4.0,1.0,4.0,1.0,3.0,2.0,1.0,82.0,3.0,3.0,4.0,2.0,5.0,2.0,0.0,0.0,0.0,0.0,1.0,0.0,0.0,0.0,0.0,1.0,5.0,6.0,1.0,3.0,1.0,1.0,0.0,0.0,0.0,0.0,-2.0,9.0,3.0
17.0,0.91526652723895,2020-04-06,2020-03-22,15.0,16.0,0.0,,1.0,,1.0,75.0,3.0,1.0,1.0,0.0,1.0,0.0,0.0,2.0,2.0,0.0,0.0,-2.0,5.0,3.0,3.0,3.0,5.0,1.0,3.0,0.0,0.0,0.0,0.0,1.0,0.0,0.0,0.0,0.0,1.0,1.0,3.0,2.0,0.0,1.0,24.0,1.0,0.0,0.0,0.0,0.0,0.0,0.0,6.0,6.0,6.0,18.0,5.0,0.0,,,,8.0,,0.0,"02,",0.0,0.0,0.0,4.0,4.0,"05,",0.0,0.0,"05,",0.0,0.0,5.0,4.0,5.0,5.0,5.0,0.0,0.0,0.0,0.0,0.0,0.0,0.0,0.0,0.0,0.0,0.0,0.0,0.0,0.0,0.0,0.0,0.0,0.0,0.0,0.0,0.0,0.0,0.0,0.0,0.0,0.0,0.0,0.0,1.0,3.0,4.0,1.0,4.0,1.0,4.0,,,,2.0,4.0,3.0,,,1.0,0.0,1.0,4.0,1.0,4.0,1.0,0.0,1.0,75.0,5.0,3.0,3.0,3.0,5.0,3.0,0.0,0.0,0.0,0.0,1.0,0.0,0.0,0.0,0.0,1.0,1.0,3.0,2.0,1.0,1.0,1.0,0.0,0.0,0.0,0.0,-2.0,16.0,1.0
18.0,1.1868700856259078,2020-04-07,2020-03-22,16.0,9.0,1.0,,3.0,,2.0,68.0,1.0,3.0,1.0,0.0,1.0,0.0,0.0,2.0,2.0,0.0,0.0,-2.0,2.0,2.0,2.0,2.0,4.0,1.0,3.0,0.0,0.0,0.0,0.0,1.0,0.0,1.0,0.0,0.0,0.0,3.0,5.0,2.0,0.0,3.0,21.0,1.0,9.0,0.0,2.0,0.0,3.0,5.0,8.0,6.0,9.0,23.0,5.0,0.0,24.0,4.0,1.0,5.0,,0.0,"02,",0.0,0.0,0.0,6.0,5.0,"05,",0.0,0.0,"02,",0.0,0.0,4.0,4.0,5.0,4.0,4.0,2.0,0.0,0.0,0.0,0.0,3.0,2.0,0.0,0.0,2.0,0.0,0.0,0.0,0.0,1.0,1.0,0.0,0.0,0.0,0.0,0.0,0.0,1.0,1.0,0.0,0.0,1.0,0.0,1.0,3.0,3.0,1.0,3.0,1.0,4.0,2.0,4.0,4.0,2.0,4.0,4.0,2.0,4.0,2.0,1.0,4.0,1.0,3.0,2.0,2.0,1.0,2.0,68.0,2.0,2.0,2.0,2.0,4.0,3.0,0.0,0.0,0.0,0.0,1.0,0.0,1.0,0.0,0.0,0.0,3.0,5.0,2.0,3.0,1.0,1.0,0.0,0.0,0.0,0.0,-2.0,9.0,3.0
19.0,0.5188631025811941,2020-04-06,2020-03-22,15.0,15.0,1.0,,3.0,,2.0,81.0,4.0,1.0,3.0,0.0,0.0,0.0,0.0,3.0,2.0,1.0,0.0,-2.0,4.0,2.0,5.0,4.0,5.0,1.0,3.0,0.0,0.0,0.0,0.0,1.0,0.0,0.0,0.0,0.0,1.0,3.0,5.0,2.0,0.0,1.0,25.0,1.0,0.0,0.0,0.0,1.0,0.0,1.0,6.0,7.0,6.0,19.0,4.0,0.0,20.0,3.3333333333333335,1.0,3.0,,0.0,"05,",0.0,0.0,0.0,4.0,4.0,"05,",0.0,0.0,"05,",0.0,0.0,5.0,5.0,5.0,5.0,5.0,0.0,0.0,0.0,0.0,0.0,0.0,0.0,0.0,0.0,0.0,0.0,0.0,0.0,0.0,0.0,0.0,1.0,0.0,0.0,0.0,0.0,0.0,0.0,0.0,0.0,0.0,0.0,0.0,2.0,2.0,4.0,1.0,4.0,1.0,3.0,3.0,3.0,3.0,2.0,4.0,4.0,3.0,3.0,2.0,1.0,5.0,0.0,3.0,2.0,1.0,0.0,2.0,81.0,4.0,2.0,5.0,4.0,5.0,3.0,0.0,0.0,0.0,0.0,1.0,0.0,0.0,0.0,0.0,1.0,3.0,5.0,2.0,1.0,3.0,0.0,0.0,0.0,1.0,0.0,-2.0,15.0,3.0
20.0,0.6264288891120424,2020-04-06,2020-03-22,15.0,9.0,1.0,,1.0,,1.0,79.0,3.0,1.0,4.0,1.0,0.0,0.0,0.0,1.0,1.0,0.0,0.0,-2.0,1.0,2.0,3.0,2.0,5.0,1.0,5.0,0.0,0.0,0.0,0.0,1.0,0.0,0.0,0.0,0.0,1.0,4.0,3.0,1.0,0.0,2.0,16.0,0.0,8.0,0.0,3.0,3.0,0.0,6.0,9.0,9.0,6.0,24.0,4.0,0.0,28.0,4.666666666666667,2.0,4.0,,0.0,"01,",0.0,1.0,0.0,2.0,2.0,"05,",0.0,0.0,"05,",0.0,0.0,3.0,5.0,3.0,2.0,3.0,0.0,0.0,3.0,0.0,0.0,1.0,3.0,1.0,0.0,0.0,1.0,2.0,0.0,0.0,0.0,0.0,0.0,1.0,1.0,0.0,1.0,0.0,0.0,0.0,0.0,0.0,0.0,0.0,2.0,2.0,3.0,1.0,4.0,1.0,5.0,1.0,5.0,4.0,1.0,5.0,5.0,2.0,4.0,3.0,2.0,4.0,1.0,4.0,1.0,1.0,0.0,1.0,79.0,1.0,2.0,3.0,2.0,5.0,5.0,0.0,0.0,0.0,0.0,1.0,0.0,0.0,0.0,0.0,1.0,4.0,3.0,1.0,2.0,4.0,0.0,0.0,0.0,0.0,0.0,-2.0,9.0,1.0
21.0,1.0419942650732081,2020-04-06,2020-03-22,15.0,9.0,1.0,,7.0,,2.0,85.0,5.0,2.0,3.0,1.0,0.0,0.0,0.0,1.0,1.0,0.0,0.0,-2.0,1.0,1.0,2.0,3.0,5.0,1.0,2.0,0.0,0.0,0.0,0.0,1.0,0.0,0.0,0.0,0.0,1.0,3.0,4.0,2.0,0.0,1.0,18.0,0.0,31.0,1.0,12.0,0.0,2.0,14.0,18.0,6.0,8.0,32.0,4.0,0.0,24.0,4.0,1.0,10.0,,0.0,"01,",0.0,1.0,0.0,6.0,3.0,"05,",0.0,0.0,"05,",0.0,0.0,4.0,4.0,3.0,4.0,3.0,5.0,1.0,2.0,1.0,4.0,4.0,3.0,3.0,3.0,5.0,0.0,4.0,1.0,0.0,3.0,4.0,0.0,0.0,0.0,0.0,0.0,0.0,0.0,1.0,0.0,0.0,0.0,1.0,2.0,2.0,3.0,1.0,4.0,1.0,4.0,1.0,5.0,3.0,2.0,4.0,4.0,2.0,4.0,4.0,3.0,2.0,3.0,2.0,3.0,2.0,1.0,2.0,85.0,1.0,1.0,2.0,3.0,5.0,2.0,0.0,0.0,0.0,0.0,1.0,0.0,0.0,0.0,0.0,1.0,3.0,4.0,2.0,1.0,3.0,0.0,0.0,0.0,0.0,0.0,-2.0,9.0,7.0
22.0,1.204846782686887,2020-04-06,2020-03-22,15.0,8.0,0.0,,4.0,,2.0,73.0,2.0,2.0,1.0,0.0,1.0,0.0,0.0,2.0,2.0,0.0,0.0,-2.0,1.0,1.0,2.0,1.0,5.0,1.0,1.0,0.0,0.0,0.0,0.0,1.0,0.0,0.0,0.0,0.0,1.0,1.0,5.0,2.0,0.0,1.0,20.0,1.0,1.0,0.0,0.0,0.0,0.0,0.0,6.0,6.0,6.0,18.0,3.0,0.0,23.0,3.8333333333333335,1.0,4.0,,0.0,"02,",0.0,0.0,0.0,6.0,2.0,"05,",0.0,0.0,"05,",0.0,0.0,4.0,3.0,5.0,4.0,4.0,0.0,0.0,0.0,0.0,0.0,1.0,0.0,0.0,0.0,0.0,0.0,0.0,0.0,0.0,0.0,0.0,0.0,0.0,0.0,0.0,0.0,0.0,0.0,0.0,0.0,0.0,0.0,0.0,3.0,1.0,3.0,1.0,4.0,1.0,5.0,2.0,4.0,2.0,2.0,4.0,4.0,2.0,4.0,2.0,1.0,4.0,1.0,4.0,1.0,2.0,1.0,2.0,73.0,1.0,1.0,2.0,1.0,5.0,1.0,0.0,0.0,0.0,0.0,1.0,0.0,0.0,0.0,0.0,1.0,1.0,5.0,2.0,1.0,1.0,1.0,0.0,0.0,0.0,0.0,-2.0,8.0,4.0
23.0,0.7936676109180433,2020-04-06,2020-03-22,15.0,14.0,1.0,,2.0,,1.0,65.0,1.0,3.0,1.0,0.0,1.0,0.0,0.0,2.0,2.0,0.0,0.0,-2.0,5.0,4.0,3.0,1.0,5.0,1.0,1.0,0.0,0.0,0.0,1.0,0.0,0.0,0.0,0.0,1.0,0.0,1.0,2.0,2.0,0.0,2.0,25.0,1.0,6.0,0.0,0.0,0.0,2.0,2.0,6.0,6.0,8.0,20.0,3.0,0.0,24.0,4.0,1.0,5.0,,0.0,"02,",0.0,0.0,0.0,5.0,5.0,"04,",0.0,0.0,"04,",0.0,0.0,5.0,5.0,5.0,5.0,5.0,0.0,0.0,0.0,2.0,2.0,0.0,0.0,0.0,2.0,0.0,0.0,0.0,0.0,0.0,0.0,0.0,0.0,0.0,0.0,0.0,0.0,0.0,0.0,0.0,0.0,0.0,1.0,1.0,4.0,1.0,3.0,1.0,3.0,1.0,5.0,1.0,5.0,4.0,2.0,4.0,4.0,4.0,2.0,2.0,1.0,5.0,0.0,2.0,3.0,2.0,1.0,1.0,65.0,5.0,4.0,3.0,1.0,5.0,1.0,0.0,0.0,0.0,1.0,0.0,0.0,0.0,0.0,1.0,0.0,1.0,2.0,2.0,2.0,1.0,1.0,0.0,0.0,0.0,0.0,-2.0,14.0,2.0
24.0,0.9525793945551978,2020-04-06,2020-03-22,15.0,16.0,0.0,,6.0,,2.0,70.0,2.0,3.0,1.0,0.0,1.0,0.0,0.0,2.0,2.0,0.0,0.0,-2.0,3.0,2.0,3.0,1.0,5.0,1.0,3.0,0.0,0.0,0.0,0.0,1.0,0.0,0.0,0.0,0.0,1.0,2.0,2.0,2.0,0.0,2.0,25.0,1.0,3.0,0.0,0.0,0.0,2.0,2.0,6.0,6.0,8.0,20.0,6.0,1.0,27.0,4.5,2.0,4.0,,0.0,"02,",0.0,0.0,0.0,6.0,6.0,"05,",0.0,0.0,"05,",0.0,0.0,5.0,5.0,5.0,5.0,5.0,0.0,0.0,0.0,3.0,0.0,0.0,0.0,0.0,0.0,0.0,0.0,0.0,0.0,0.0,0.0,0.0,0.0,0.0,0.0,0.0,0.0,0.0,0.0,1.0,0.0,0.0,1.0,0.0,2.0,2.0,2.0,2.0,2.0,2.0,5.0,1.0,5.0,5.0,1.0,5.0,3.0,2.0,4.0,2.0,1.0,4.0,1.0,3.0,2.0,1.0,0.0,2.0,70.0,3.0,2.0,3.0,1.0,5.0,3.0,0.0,0.0,0.0,0.0,1.0,0.0,0.0,0.0,0.0,1.0,2.0,2.0,2.0,2.0,1.0,1.0,0.0,0.0,0.0,0.0,-2.0,16.0,6.0
25.0,1.22101337466085,2020-04-06,2020-03-22,15.0,5.0,0.0,,4.0,,1.0,78.0,3.0,3.0,1.0,0.0,1.0,0.0,0.0,2.0,2.0,0.0,0.0,-2.0,4.0,4.0,3.0,2.0,4.0,1.0,2.0,0.0,1.0,0.0,0.0,0.0,0.0,0.0,0.0,0.0,1.0,5.0,2.0,2.0,0.0,1.0,21.0,1.0,9.0,0.0,5.0,0.0,5.0,10.0,11.0,6.0,11.0,28.0,3.0,0.0,22.0,3.6666666666666665,1.0,3.0,,0.0,"02,",0.0,0.0,0.0,6.0,6.0,"02,",0.0,0.0,"05,",0.0,0.0,4.0,2.0,5.0,5.0,5.0,1.0,0.0,1.0,0.0,2.0,1.0,1.0,1.0,1.0,1.0,1.0,1.0,0.0,1.0,1.0,1.0,0.0,0.0,0.0,0.0,0.0,0.0,1.0,1.0,0.0,1.0,1.0,1.0,3.0,1.0,3.0,1.0,3.0,1.0,4.0,2.0,4.0,2.0,2.0,4.0,4.0,2.0,4.0,2.0,1.0,4.0,1.0,4.0,1.0,1.0,0.0,1.0,78.0,4.0,4.0,3.0,2.0,4.0,2.0,0.0,1.0,0.0,0.0,0.0,0.0,0.0,0.0,0.0,1.0,5.0,2.0,2.0,1.0,1.0,1.0,0.0,0.0,0.0,0.0,-2.0,5.0,4.0
26.0,0.5787748303768011,2020-04-06,2020-03-22,15.0,11.0,1.0,,7.0,,1.0,71.0,2.0,1.0,4.0,1.0,0.0,0.0,0.0,1.0,1.0,0.0,0.0,-2.0,5.0,3.0,3.0,1.0,5.0,1.0,4.0,0.0,0.0,0.0,0.0,1.0,0.0,0.0,0.0,0.0,1.0,5.0,6.0,3.0,0.0,1.0,21.0,1.0,4.0,0.0,0.0,2.0,0.0,2.0,6.0,8.0,6.0,20.0,4.0,0.0,21.0,3.5,1.0,6.0,,0.0,"01,",0.0,1.0,0.0,2.0,4.0,"05,",0.0,0.0,"05,",0.0,0.0,4.0,4.0,4.0,5.0,4.0,1.0,0.0,0.0,0.0,0.0,1.0,1.0,0.0,1.0,0.0,0.0,0.0,0.0,0.0,0.0,0.0,0.0,1.0,0.0,0.0,1.0,0.0,0.0,0.0,0.0,0.0,0.0,0.0,3.0,1.0,2.0,2.0,3.0,1.0,4.0,3.0,3.0,4.0,3.0,3.0,4.0,3.0,3.0,3.0,2.0,4.0,1.0,3.0,2.0,2.0,1.0,1.0,71.0,5.0,3.0,3.0,1.0,5.0,4.0,0.0,0.0,0.0,0.0,1.0,0.0,0.0,0.0,0.0,1.0,5.0,6.0,3.0,1.0,4.0,0.0,0.0,0.0,0.0,0.0,-2.0,11.0,7.0
27.0,1.4637177165336421,2020-04-06,2020-03-22,15.0,8.0,0.0,,4.0,,1.0,68.0,1.0,3.0,1.0,0.0,1.0,0.0,0.0,2.0,2.0,0.0,0.0,-2.0,2.0,2.0,2.0,1.0,5.0,1.0,4.0,0.0,0.0,0.0,1.0,0.0,0.0,0.0,1.0,0.0,0.0,3.0,5.0,2.0,0.0,1.0,20.0,1.0,8.0,0.0,0.0,1.0,1.0,2.0,6.0,7.0,7.0,20.0,4.0,0.0,24.0,4.0,1.0,4.0,,0.0,"02,",0.0,0.0,0.0,6.0,6.0,"04,",0.0,0.0,"03,",0.0,0.0,4.0,4.0,4.0,4.0,4.0,0.0,0.0,0.0,0.0,1.0,3.0,2.0,1.0,0.0,1.0,0.0,0.0,0.0,0.0,0.0,0.0,0.0,1.0,0.0,0.0,0.0,0.0,0.0,1.0,0.0,0.0,0.0,0.0,2.0,2.0,3.0,1.0,4.0,1.0,4.0,2.0,4.0,4.0,2.0,4.0,3.0,1.0,5.0,2.0,1.0,4.0,1.0,3.0,2.0,1.0,0.0,1.0,68.0,2.0,2.0,2.0,1.0,5.0,4.0,0.0,0.0,0.0,1.0,0.0,0.0,0.0,1.0,0.0,0.0,3.0,5.0,2.0,1.0,1.0,1.0,0.0,0.0,0.0,0.0,-2.0,8.0,4.0
28.0,1.456377331201124,2020-04-06,2020-03-22,15.0,5.0,0.0,,6.0,,2.0,82.0,4.0,3.0,1.0,0.0,1.0,0.0,0.0,2.0,2.0,0.0,0.0,-2.0,3.0,3.0,4.0,4.0,5.0,1.0,1.0,0.0,0.0,0.0,0.0,1.0,0.0,0.0,0.0,0.0,1.0,1.0,1.0,2.0,0.0,1.0,24.0,1.0,22.0,0.0,3.0,0.0,4.0,7.0,9.0,6.0,10.0,25.0,4.0,0.0,20.0,3.3333333333333335,1.0,3.0,,0.0,"02,",0.0,0.0,0.0,6.0,6.0,"05,",0.0,0.0,"05,",0.0,0.0,5.0,4.0,5.0,5.0,5.0,4.0,0.0,0.0,3.0,2.0,2.0,2.0,2.0,3.0,4.0,1.0,0.0,0.0,0.0,0.0,2.0,0.0,0.0,0.0,0.0,0.0,0.0,1.0,1.0,0.0,0.0,1.0,1.0,3.0,1.0,2.0,2.0,3.0,1.0,3.0,4.0,2.0,4.0,3.0,3.0,4.0,2.0,4.0,1.0,0.0,5.0,0.0,4.0,1.0,3.0,2.0,2.0,82.0,3.0,3.0,4.0,4.0,5.0,1.0,0.0,0.0,0.0,0.0,1.0,0.0,0.0,0.0,0.0,1.0,1.0,1.0,2.0,1.0,1.0,1.0,0.0,0.0,0.0,0.0,-2.0,5.0,6.0
29.0,2.323982706435254,2020-04-06,2020-03-22,15.0,11.0,1.0,,7.0,,1.0,90.0,5.0,3.0,4.0,1.0,0.0,0.0,0.0,1.0,1.0,0.0,0.0,-2.0,5.0,2.0,4.0,3.0,5.0,1.0,3.0,0.0,0.0,0.0,0.0,1.0,0.0,0.0,0.0,0.0,1.0,2.0,3.0,1.0,0.0,2.0,21.0,1.0,17.0,0.0,10.0,6.0,3.0,19.0,16.0,12.0,9.0,37.0,5.0,0.0,12.0,2.0,0.0,7.0,,0.0,"01,",0.0,1.0,0.0,6.0,6.0,"05,",0.0,0.0,"05,",0.0,0.0,4.0,4.0,4.0,5.0,4.0,5.0,0.0,0.0,0.0,0.0,0.0,5.0,0.0,3.0,4.0,0.0,0.0,1.0,1.0,4.0,4.0,0.0,4.0,1.0,0.0,1.0,0.0,1.0,0.0,0.0,0.0,1.0,1.0,2.0,2.0,2.0,2.0,4.0,1.0,3.0,5.0,1.0,3.0,4.0,2.0,1.0,4.0,2.0,3.0,2.0,2.0,3.0,3.0,2.0,1.0,0.0,1.0,90.0,5.0,2.0,4.0,3.0,5.0,3.0,0.0,0.0,0.0,0.0,1.0,0.0,0.0,0.0,0.0,1.0,2.0,3.0,1.0,2.0,4.0,0.0,0.0,0.0,0.0,0.0,-2.0,11.0,7.0
30.0,0.5788262568705757,2020-04-06,2020-03-22,15.0,8.0,0.0,,4.0,,1.0,78.0,3.0,3.0,1.0,0.0,1.0,0.0,0.0,2.0,2.0,0.0,0.0,-2.0,3.0,3.0,2.0,2.0,5.0,1.0,2.0,0.0,0.0,0.0,0.0,1.0,0.0,0.0,0.0,0.0,1.0,5.0,5.0,2.0,0.0,1.0,25.0,1.0,7.0,0.0,2.0,0.0,0.0,2.0,8.0,6.0,6.0,20.0,3.0,0.0,29.0,4.833333333333333,2.0,4.0,,0.0,"02,",0.0,0.0,0.0,6.0,6.0,"05,",0.0,0.0,"05,",0.0,0.0,5.0,5.0,5.0,5.0,5.0,0.0,0.0,0.0,0.0,0.0,1.0,0.0,0.0,0.0,6.0,0.0,0.0,0.0,0.0,1.0,1.0,0.0,0.0,0.0,0.0,0.0,0.0,0.0,0.0,0.0,0.0,0.0,0.0,3.0,1.0,3.0,1.0,4.0,1.0,5.0,1.0,5.0,4.0,1.0,5.0,5.0,1.0,5.0,3.0,2.0,5.0,0.0,3.0,2.0,1.0,0.0,1.0,78.0,3.0,3.0,2.0,2.0,5.0,2.0,0.0,0.0,0.0,0.0,1.0,0.0,0.0,0.0,0.0,1.0,5.0,5.0,2.0,1.0,1.0,1.0,0.0,0.0,0.0,0.0,-2.0,8.0,4.0
31.0,2.9560359902711473,2020-04-15,2020-03-22,24.0,9.0,1.0,,3.0,,1.0,85.0,5.0,1.0,1.0,0.0,1.0,1.0,0.0,3.0,2.0,0.0,0.0,3.0,4.0,5.0,5.0,5.0,5.0,1.0,5.0,0.0,0.0,0.0,0.0,1.0,0.0,0.0,0.0,0.0,1.0,1.0,3.0,3.0,0.0,1.0,23.0,1.0,18.0,0.0,3.0,0.0,,,9.0,6.0,,,3.0,0.0,,,,1.0,,0.0,"02,03,",0.0,0.0,0.0,2.0,2.0,"05,",0.0,0.0,"05,",0.0,0.0,5.0,4.0,5.0,4.0,5.0,4.0,0.0,0.0,0.0,3.0,5.0,1.0,0.0,0.0,5.0,0.0,0.0,0.0,2.0,0.0,1.0,0.0,0.0,0.0,0.0,0.0,0.0,0.0,0.0,0.0,0.0,0.0,,4.0,1.0,4.0,1.0,4.0,1.0,5.0,,,1.0,1.0,5.0,5.0,1.0,5.0,1.0,0.0,5.0,0.0,4.0,1.0,1.0,0.0,1.0,85.0,4.0,5.0,5.0,5.0,5.0,5.0,0.0,0.0,0.0,0.0,1.0,0.0,0.0,0.0,0.0,1.0,1.0,3.0,3.0,1.0,1.0,1.0,1.0,0.0,0.0,0.0,3.0,9.0,3.0
32.0,0.635395344723765,2020-04-15,2020-03-22,24.0,5.0,0.0,,4.0,,2.0,73.0,2.0,2.0,4.0,1.0,0.0,0.0,0.0,1.0,1.0,0.0,0.0,-2.0,1.0,2.0,4.0,3.0,4.0,1.0,4.0,0.0,0.0,0.0,0.0,1.0,0.0,0.0,0.0,0.0,1.0,2.0,5.0,3.0,0.0,2.0,20.0,1.0,9.0,0.0,7.0,3.0,2.0,12.0,13.0,9.0,8.0,30.0,4.0,0.0,25.0,4.166666666666667,1.0,6.0,,0.0,"01,",0.0,1.0,0.0,3.0,4.0,"05,",0.0,0.0,"05,",0.0,0.0,4.0,4.0,4.0,4.0,4.0,2.0,0.0,1.0,1.0,1.0,1.0,1.0,0.0,1.0,1.0,1.0,1.0,1.0,1.0,2.0,1.0,1.0,1.0,0.0,1.0,0.0,0.0,0.0,1.0,0.0,0.0,1.0,0.0,2.0,2.0,3.0,1.0,4.0,1.0,4.0,2.0,4.0,4.0,2.0,4.0,5.0,2.0,4.0,3.0,2.0,3.0,2.0,4.0,1.0,2.0,1.0,2.0,73.0,1.0,2.0,4.0,3.0,4.0,4.0,0.0,0.0,0.0,0.0,1.0,0.0,0.0,0.0,0.0,1.0,2.0,5.0,3.0,2.0,4.0,0.0,0.0,0.0,0.0,0.0,-2.0,5.0,4.0